{"text_format":"3","workbook":"xlsx","n_sheets":10,"sheets":["CONDITIONS","Len_DB","Input","RefText_DB","Output","Calculation Report","EJeff","sharp metal","CLT panel","Dati"],"not_rendered":{"images":19,"macros":1,"defined_names":30,"comments":2},"read":"whole","date_system":"1900"}

{"sheet":"CONDITIONS","index":0,"n_rows":66,"n_cols":5,"rows_kept":66,"merged":[[1,3,3,3],[2,4,3,4],[6,2,8,4],[11,1,11,4],[15,2,15,4],[19,2,19,4],[23,2,23,4],[28,2,28,4],[32,2,32,4],[36,2,36,4],[40,2,40,4],[44,2,44,4],[48,2,48,4],[53,2,53,4],[58,2,58,4],[62,2,62,4],[63,2,63,4],[65,0,67,5]]}
[]
[{"$nulls":3},"SHARP_METAL_CALCULATOR\nv1.2",{"$f":"INDEX(LEN_CON[],1,MATCH($E$3,LEN_CON[#Headers],0))","v":"Language"}]
[{"$nulls":4},"EN"]
[]
[]
[{"$nulls":3},{"$f":"INDEX(LEN_CON[],2,MATCH($E$3,LEN_CON[#Headers],0))","v":"SHARP METAL CALCULATOR"}]
[null,null,{"$f":"INDEX(LEN_CON[],3,MATCH($E$3,LEN_CON[#Headers],0))","v":"GENERAL TERMS AND CONDITIONS OF THE LICENSE AGREEMENT FOR THE USE OF THE SPREADSHEET \"SHARP_METAL_CALCULATOR\""}]
[]
[]
[]
{"$rows_left_out":57}
{"sheet":"Len_DB","index":1,"n_rows":257,"n_cols":8,"rows_kept":257,"hidden":true,"merged":[[1,2,1,6],[5,2,5,6],[37,2,37,6],[88,2,88,6],[129,2,129,6]]}
[]
[null,null,"LENGUAGES"]
[]
[null,null,"IT","EN","DE","FR","ES"]
[]
[null,null,"CONDITIONS"]
[]
[null,"Column1","IT","EN","DE","FR","ES","Column2"]
[null,1,"Lingua","Language","Sprache","Langue","Idioma"]
[null,2,"SHARP METAL CALCULATOR","SHARP METAL CALCULATOR","SHARP METAL CALCULATOR","SHARP METAL CALCULATOR","SHARP METAL CALCULATOR"]
{"$rows_left_out":248}
{"sheet":"Input","index":2,"n_rows":46,"n_cols":12,"rows_kept":46,"hidden":true,"merged":[[0,3,0,8],[0,10,0,11],[2,1,2,11],[4,2,4,3],[4,8,4,11],[5,2,5,5],[5,8,6,11],[6,2,6,5],[7,2,7,5],[8,2,8,5],[9,2,9,5],[11,1,11,11],[13,2,13,3],[13,8,13,11],[14,2,14,3],[14,8,14,11],[15,2,15,3],[17,1,17,11],[19,1,19,5],[19,7,19,11],[21,2,21,5],[21,8,21,11],[23,1,23,11],[25,1,25,5],[25,7,25,11],[27,2,27,5],[27,8,27,9],[28,2,28,3],[28,8,28,9],[29,2,29,3],[29,8,29,9],[30,2,30,3],[32,2,32,3],[34,1,34,11],[36,1,36,11],[38,1,38,5],[38,7,38,11],[40,2,40,5],[40,8,40,11],[41,2,41,3],[41,8,41,9],[42,4,42,5],[42,10,42,11],[43,2,43,3],[43,8,43,9],[45,2,45,3],[45,8,45,9],[47,1,47,5],[47,7,47,11]]}
[{"$nulls":3},"SHARP_METAL_CALCULATOR_v1.2",{"$nulls":6},"SHARP METAL"]
[]
[null,{"$f":"INDEX(LEN_IN[],1,MATCH(CONDITIONS!$E$3,Len_DB!$C$8:$H$8,0)+1)","v":"Project informations"}]
[]
[null,{"$f":"INDEX(LEN_IN[],2,MATCH(CONDITIONS!$E$3,Len_DB!$C$8:$H$8,0)+1)","v":"Data"},{"$f":"TODAY()","v":"2026-08-31"},{"$nulls":4},{"$f":"INDEX(LEN_IN[],8,MATCH(CONDITIONS!$E$3,Len_DB!$C$8:$H$8,0)+1)","v":"Standard"},"UNI EN 1995:2014"]
[null,{"$f":"INDEX(LEN_IN[],3,MATCH(CONDITIONS!$E$3,Len_DB!$C$8:$H$8,0)+1)","v":"Municipality"},{"$nulls":5},{"$f":"INDEX(LEN_IN[],9,MATCH(CONDITIONS!$E$3,Len_DB!$C$8:$H$8,0)+1)","v":"Notes"}]
[null,{"$f":"INDEX(LEN_IN[],4,MATCH(CONDITIONS!$E$3,Len_DB!$C$8:$H$8,0)+1)","v":"Province"}]
[null,{"$f":"INDEX(LEN_IN[],5,MATCH(CONDITIONS!$E$3,Len_DB!$C$8:$H$8,0)+1)","v":"Project"}]
[null,{"$f":"INDEX(LEN_IN[],6,MATCH(CONDITIONS!$E$3,Len_DB!$C$8:$H$8,0)+1)","v":"Designer"}]
[null,{"$f":"INDEX(LEN_IN[],7,MATCH(CONDITIONS!$E$3,Len_DB!$C$8:$H$8,0)+1)","v":"Client"}]
{"$rows_left_out":37}
{"sheet":"RefText_DB","index":3,"n_rows":17,"n_cols":2,"rows_kept":17,"hidden":true}
[]
[]
[]
[null,"UNI EN 1995:2014"]
[null,"NTC2018"]
[]
[]
[]
[null,"SHARP METAL (alone) + TBS MAX@a = 250mm"]
[null,"SHARP METAL + TBS MAX@a ≤ 100mm"]
{"$rows_left_out":8}
{"sheet":"Output","index":4,"n_rows":81,"n_cols":12,"rows_kept":81,"hidden":true,"merged":[[0,3,0,8],[0,10,0,11],[2,1,2,11],[4,2,4,3],[4,8,4,11],[5,2,5,5],[5,8,6,11],[6,2,6,5],[7,2,7,5],[8,2,8,5],[9,2,9,5],[11,1,11,11],[15,1,15,5],[15,7,15,11],[17,3,17,4],[17,9,17,10],[18,3,18,4],[18,9,18,10],[19,3,19,4],[19,9,19,10],[21,1,21,5],[23,3,23,4],[24,3,24,4],[26,1,26,11],[30,1,30,5],[30,7,30,11],[32,3,32,4],[32,9,32,10],[33,3,33,4],[33,9,33,10],[34,3,34,4],[34,9,34,10],[36,3,36,4],[36,9,36,10],[37,3,37,4],[37,9,37,10],[38,3,38,4],[38,9,38,10],[40,1,40,5],[42,3,42,4],[43,3,43,4],[45,3,45,4],[46,3,46,4],[48,1,48,11],[56,1,56,11],[64,3,64,8],[64,10,64,11],[66,1,66,11],[70,3,70,4],[71,2,71,3],[72,2,72,3],[80,7,80,11]]}
[{"$nulls":3},{"$f":"Input!D1","v":"SHARP_METAL_CALCULATOR_v1.2"},{"$nulls":6},"SHARP METAL"]
[]
[null,{"$f":"Input!B3","v":"Project informations"}]
[]
[null,{"$f":"Input!B5","v":"Data"},{"$f":"Input!C5","v":"2026-08-31"},{"$nulls":4},{"$f":"INDEX(LEN_IN[],8,MATCH(CONDITIONS!$E$3,Len_DB!$C$8:$H$8,0)+1)","v":"Standard"},{"$f":"IF(ISBLANK(Input!I5),\"\",Input!I5)","v":"UNI EN 1995:2014"}]
[null,{"$f":"Input!B6","v":"Municipality"},{"$f":"IF(ISBLANK(Input!C6),\"\",Input!C6)","v":""},{"$nulls":4},{"$f":"INDEX(LEN_IN[],9,MATCH(CONDITIONS!$E$3,Len_DB!$C$8:$H$8,0)+1)","v":"Notes"},{"$f":"IF(ISBLANK(Input!I6),\"\",Input!I6)","v":""}]
[null,{"$f":"Input!B7","v":"Province"},{"$f":"IF(ISBLANK(Input!C7),\"\",Input!C7)","v":""}]
[null,{"$f":"Input!B8","v":"Project"},{"$f":"IF(ISBLANK(Input!C8),\"\",Input!C8)","v":""}]
[null,{"$f":"Input!B9","v":"Designer"},{"$f":"IF(ISBLANK(Input!C9),\"\",Input!C9)","v":""}]
[null,{"$f":"Input!B10","v":"Client"},{"$f":"IF(ISBLANK(Input!C10),\"\",Input!C10)","v":""}]
{"$rows_left_out":72}
{"sheet":"Calculation Report","index":5,"n_rows":539,"n_cols":12,"rows_kept":539,"hidden":true,"merged":[[6,2,11,7],[10,10,10,11],[12,9,12,11],[14,3,14,11],[16,3,16,10],[18,3,18,8],[23,3,23,6],[23,8,23,11],[27,3,27,6],[27,8,27,11],[34,1,34,11],[36,2,36,9],[38,1,38,5],[38,7,38,11],[40,2,40,5],[40,8,40,11],[44,2,44,3],[44,8,44,9],[45,2,45,3],[45,8,45,9],[47,1,47,11],[49,2,49,3],[49,8,49,11],[50,2,50,3],[51,2,51,3],[51,8,51,11],[53,1,53,11],[55,1,55,11],[57,2,57,3],[58,2,58,3],[59,2,59,3],[61,1,61,11],[64,1,64,11],[66,2,66,4],[70,1,70,3],[86,1,86,11],[88,2,88,4],[92,1,92,3],[111,1,111,11],[113,1,113,5],[113,7,113,11],[115,2,115,3],[115,8,115,9],[116,2,116,3],[116,8,116,9],[117,8,117,9],[118,2,118,3],[120,1,120,11],[122,1,122,11],[124,1,124,5],[124,7,124,11],[126,1,126,5],[126,7,126,11],[128,1,128,5],[128,7,128,11],[130,2,130,3],[130,8,130,9],[134,2,134,3],[134,8,134,9],[136,2,136,3],[136,8,136,9],[138,1,138,5],[138,7,138,11],[140,2,140,3],[140,8,140,9],[141,2,141,3],[141,8,141,9],[142,2,142,3],[142,8,142,9],[144,1,145,1],[144,2,144,3],[144,7,145,7],[144,8,144,9],[145,2,145,3],[145,8,145,9],[147,1,147,11],[149,2,149,3],[149,8,149,9],[150,2,150,3],[150,8,150,9],[151,2,151,3],[151,8,151,9],[154,1,154,11],[156,2,156,3],[157,2,157,3],[162,1,162,5],[162,7,162,11],[164,1,164,11],[169,1,169,5],[169,7,169,11],[171,1,171,5],[171,7,171,11],[173,2,173,3],[173,8,173,9],[174,2,174,3],[174,8,174,9],[176,1,176,5],[176,7,176,11],[178,2,178,3],[178,8,178,9],[179,2,179,3],[179,8,179,9],[181,1,181,5],[181,7,181,11],[189,2,189,3],[189,8,189,9],[191,1,191,5],[191,7,191,11],[195,2,195,3],[195,8,195,9],[204,1,204,5],[204,7,204,11],[206,1,206,5],[206,7,206,11],[208,2,208,3],[208,8,208,9],[211,2,211,3],[211,8,211,9],[212,2,212,3],[212,8,212,9],[214,1,214,5],[214,7,214,11],[218,2,218,3],[218,8,218,9],[219,2,219,3],[219,8,219,9],[221,1,221,5],[221,7,221,11],[229,2,229,3],[229,8,229,9],[234,2,234,3],[234,8,234,9],[242,1,242,5],[242,7,242,11],[246,1,246,5],[246,7,246,11],[249,1,249,5],[249,7,249,11],[251,1,251,5],[251,7,251,11],[253,2,253,3],[253,8,253,9],[256,2,256,3],[256,8,256,9],[257,2,257,3],[257,8,257,9],[259,1,259,5],[259,7,259,11],[263,2,263,3],[263,8,263,9],[264,2,264,3],[264,8,264,9],[266,1,266,5],[266,7,266,11],[274,2,274,3],[274,8,274,9],[279,2,279,3],[279,8,279,9],[287,1,287,5],[287,7,287,11],[291,1,291,5],[291,7,291,11],[294,1,294,11],[296,1,296,5],[296,7,296,11],[298,1,298,3],[298,7,298,9],[301,1,301,3],[301,7,301,9],[307,1,307,3],[307,7,307,9],[310,1,310,3],[310,7,310,9],[313,1,313,3],[316,1,316,11],[318,1,318,11],[320,1,320,3],[320,7,320,9],[323,1,323,11],[325,1,325,3],[325,7,325,9],[330,1,330,11],[332,1,332,5],[332,7,332,11],[334,1,334,3],[334,7,334,9],[337,1,337,3],[337,7,337,9],[343,1,343,3],[343,7,343,9],[346,1,346,3],[346,7,346,9],[349,1,349,3],[352,1,352,11],[354,1,354,11],[356,1,356,3],[356,7,356,9],[359,1,359,11],[361,1,361,3],[361,7,361,9],[366,1,366,11],[368,1,368,5],[368,7,368,11],[370,1,370,3],[370,7,370,9],[373,1,373,3],[373,7,373,9],[379,1,379,3],[379,7,379,9],[382,1,382,3],[382,7,382,9],[385,1,385,3],[388,1,388,11],[390,1,390,11],[392,1,392,3],[392,7,392,9],[395,1,395,11],[397,1,397,3],[397,7,397,9],[402,1,402,11],[404,1,404,3],[406,1,406,3],[408,1,408,3],[410,1,410,11],[412,1,412,11],[414,1,414,5],[414,7,414,11],[416,2,416,3],[416,8,416,9],[418,2,418,3],[418,8,418,9],[420,1,421,1],[420,7,421,7],[420,10,421,10],[420,11,421,11],[424,2,424,3],[426,1,426,5],[430,2,430,3],[439,1,439,11],[445,1,445,5],[445,7,445,11],[452,2,452,3],[452,8,452,9],[454,2,454,3],[454,8,454,9],[456,1,457,1],[456,7,457,7],[456,10,457,10],[456,11,457,11],[460,2,460,3],[462,1,462,5],[466,2,466,3],[474,1,474,11],[476,1,476,5],[476,7,476,11],[479,1,479,3],[479,7,479,9],[482,1,482,3],[482,7,482,9],[489,1,489,11],[491,2,491,3],[493,2,493,3],[493,8,493,9],[495,2,495,3],[497,2,497,3],[499,2,499,3],[503,2,503,3],[505,2,505,3],[507,2,507,3],[509,2,509,3],[511,2,511,3],[513,2,513,3],[513,7,513,11],[515,1,532,11],[535,2,536,11],[538,2,539,11]]}
[]
[]
[]
[]
[]
[]
[null,null,{"$f":"INDEX(LEN_REPORT[],1,MATCH(CONDITIONS!$E$3,Len_DB!$C$8:$H$8,0)+1)","v":"Technical calculation report"}]
[]
[]
[]
{"$rows_left_out":512}
{"sheet":"EJeff","index":6,"n_rows":43,"n_cols":36,"rows_kept":43,"hidden":true,"merged":[[4,27,4,30],[4,32,4,35],[6,1,6,9],[6,10,6,11],[6,12,6,13],[6,15,6,17],[6,18,6,20],[6,21,6,22],[6,24,6,25],[6,27,6,28],[6,29,6,30],[6,32,6,33],[6,34,6,35],[7,1,8,1],[7,10,7,11],[7,12,7,13],[7,15,7,17],[7,18,7,20],[7,21,7,22],[7,24,7,25],[7,27,7,28],[7,29,7,30],[7,32,7,33],[7,34,7,35]]}
[null,"DO NOT TOUCH THESE. Change in DATA or in CLT PANEL"]
[null,"b(mm)",null,null,"E0,mean","E90,mean","Gmean","Gr,mean",null,null,"bef,ij(mm)",{"$f":"(Input!$E$30-Input!$K$30)*(0.5-0.35*((Input!$E$30-Input!$K$30)/Input!$E$33)^0.9*($E$3*MAX($Y$21:$Z$21)/($G$3*SUM($Y$21:$Z$21)))^0.45)","v":{"v":175.2065832970813,"d":"175.21"}},{"$nulls":20},"bef,ij(mm)",{"$f":"MAX(C10:C20)","v":{"v":30,"d":"30.00"}},"[mm]"]
[null,{"$f":"Input!$E$30","v":600},null,null,{"$f":"INDEX(TimberType[],MATCH(Input!$C$22,TimberType[Classe],0),MATCH(E2,TimberType[#Headers],0))","v":11000},{"$f":"INDEX(TimberType[],MATCH(Input!$C$22,TimberType[Classe],0),MATCH(F2,TimberType[#Headers],0))","v":370},{"$f":"INDEX(TimberType[],MATCH(Input!$C$22,TimberType[Classe],0),MATCH(G2,TimberType[#Headers],0))","v":690},69,{"$f":"Input!$C$28","v":"80mm-3s-   30 20 30   "},null,"bef",{"$f":"L2*2+Input!$K$30","v":{"v":510.4131665941626,"d":"510.41"}},"scelto in INPUT",{"$f":"Input!C28","v":"80mm-3s-   30 20 30   "},{"$nulls":10},"NUOVO EUROCODICE5 O STORANESO",{"$nulls":7},"bef",{"$f":"AH2*2+Input!$K$30","v":{"v":220,"d":"220.00"}},"[mm]"]
[]
[null,null,{"$f":"MATCH($I$3,CLT[Code],0)","v":3},null,null,{"$f":"MATCH(B10,CLT[#Headers],0)","v":5},{"$nulls":21},"At mid span",{"$nulls":4},"At support"]
[null,"Berechnung von Brettsperrholzelementen"]
[null,"Se non c'è lamella, indicare d=0",{"$nulls":8},"INERZIA",null,"Biegesteifigkeiten",null,"Drillsteifigkeit1)","Plattenschubsteifigkeit ",null,null,"Plattenschubsteifigkeit ",null,null,"Dehnsteifigkeiten",null,"Scheibenschubsteifigkeit ","area",null,null,"INERZIA CON BASE EFFICACE",null,"area CON BASE EFFICACE",null,null,"INERZIA CON BASE EFFICACE",null,"area CON BASE EFFICACE"]
[null,"Lagen","di","ai","Exx,i","Eyy,i","Gxz,i","Gyz,i","Gxy,i=Gyx,i","zi","mm^4",null,"[MNm²/m] ∙10-3",null,"[MN/m] ∙10-3","[MN/m] ∙10-3",null,null,"[MN/m] ∙10-3",null,null,"[MN/m]",null,"[MN/m]","mm^2",null,null,"[mm4]",null,"[mm2]",null,null,"[mm4]",null,"[mm2]"]
[null,null,"[mm]","[mm]","[MN/m²]","[MN/m²]","[MN/m²]","[MN/m²]","[MN/m²]","[mm]","jxx,i ","Jy,i","Bx,i ","By,i","Bxy,i","EIx,B,i","cxz,i","1/Sxz,i","EIy,B,i","cxz,i","1/Sxz,i","Dx,i","Dx,i","Dxj,i","AX","AY",null,"jxx,i","Jy,i","AX","AY",null,"jxx,i","Jy,i","AX","AY"]
[null,{"$f":"CLT[[#Headers],[11]]","v":"11"},{"$f":"IF(INDEX(CLT[],MATCH($I$3,CLT[Code],0),MATCH(B10,CLT[#Headers],0))=\"\",0,INDEX(CLT[],MATCH($I$3,CLT[Code],0),MATCH(B10,CLT[#Headers],0)))","v":0},{"$f":"IF(C10=0,0,$C$15/2+IF(B10=CLT[[#Headers],[3]],$C$14/2,IF(B10=CLT[[#Headers],[5]],$C$14+$C$13/2,IF(B10=CLT[[#Headers],[7]],$C$14+$C$13+$C$12/2,IF(B10=CLT[[#Headers],[9]],$C$14+$C$13+$C$12+$C$11/2,IF(B10=CLT[[#Headers],[11]],$C$14+$C$13+$C$12+$C$11+$C$10/2,-$C$15/2))))))","v":0},{"$f":"E3","v":11000},{"$f":"F3","v":370},{"$f":"G3","v":690},{"$f":"H3","v":69},690,{"$f":"J11-C11/2-C10/2","v":-40},{"$f":"IF(E10>F10,(C10^3/12+C10*(J10^2))*$B$3,0)","v":0},{"$f":"IF(E10<F10,(C10^3/12+C10*(J10^2))*$B$3,0)","v":0},{"$f":"(E10*(C10/1000)^3/12+E10*C10/1000*(J10/1000)^2)*10^3","v":{"v":0,"d":"0.00"}},{"$f":"(F10*(C10/1000)^3/12+F10*C10/1000*(J10/1000)^2)*1000","v":{"v":0,"d":"0.00"}},{"$f":"(2*I10*C10/1000*(J10/1000)^2+I10*(C10/1000)^3/6)*1000","v":{"v":0,"d":"0.00"}},{"$f":"(E10*C10/1000*(J10/1000)^2)*1000","v":0},{"$f":"1/$P$21*E10*C10/1000*J10/1000*10^3","v":0},{"$f":"IF(C10=0,\"\",(C10/1000)/(3*G10)*(Q10+Q10^2)*1000)","v":""},{"$f":"(F10*C10/1000*(J10/1000)^2)*1000","v":0},{"$f":"1/$S$21*F10*C10/1000*J10/1000*10^3","v":0},{"$f":"IF(C10=0,\"\",(C10/1000)/(3*H10)*(T10+T10^2)*1000)","v":""},{"$f":"C10/1000*E10","v":0},{"$f":"C10/1000*F10","v":0},{"$f":"C10/1000*I10","v":0},{"$f":"IF(E10>F10,$B$3*C10,0)","v":0},{"$f":"IF(E10<F10,$B$3*C10,0)","v":0},null,{"$f":"IF(E10>F10,(C10^3/12+C10*(J10^2))*$L$3,0)","v":0},{"$f":"IF(E10<F10,(C10^3/12+C10*(J10^2))*$L$3,0)","v":0},{"$f":"IF(E10>F10,$L$3*C10,0)","v":0},{"$f":"IF(E10<F10,$L$3*C10,0)","v":0},null,{"$f":"IF(E10>F10,(C10^3/12+C10*(J10^2))*$AH$3,0)","v":0},{"$f":"IF(E10<F10,(C10^3/12+C10*(J10^2))*$AH$3,0)","v":0},{"$f":"IF(E10>F10,$AH$3*C10,0)","v":0},{"$f":"IF(E10<F10,$AH$3*C10,0)","v":0}]
{"$rows_left_out":34}
{"sheet":"sharp metal","index":7,"n_rows":14,"n_cols":10,"rows_kept":14,"hidden":true,"merged":[[1,1,1,3],[1,5,1,7]]}
[]
[null,"At support",{"$nulls":3},"At mid span",{"$nulls":3},"ETA-24/0058"]
[]
[null,"INPUT L/4",{"$f":"Input!C41","v":"SHARP METAL + TBS MAX@a ≤ 100mm"},null,null,"INPUT L/2",{"$f":"Input!I41","v":"SHARP METAL + TBS MAX@a ≤ 100mm"}]
[null,"b",50,"mm",null,"b",50,"mm"]
[null,"n°",{"$f":"Input!$E$43","v":2},null,null,"n°",{"$f":"Input!$K$43","v":1}]
[null,"lef",{"$f":"MIN(0.9*1000,1000-10)","v":900},"mm",null,"lef",{"$f":"MIN(0.9*1000,1000-10)","v":900},"mm"]
[null,"kv,0,0",{"$f":"IF(C4=RefText_DB!$B$9,1.76,IF(C4=RefText_DB!$B$10,3.05,IF(C4=RefText_DB!$B$11,2.47,\"errore\")))","v":3.05},"N/mm3",null,"kv,0,0",{"$f":"IF(G4=RefText_DB!$B$9,1.76,IF(G4=RefText_DB!$B$10,3.05,IF(G4=RefText_DB!$B$11,2.47,\"errore\")))","v":3.05},"N/mm3"]
[null,"Kv,ser",{"$f":"C8*C7*C6*C5","v":274500},"N/mm  ",null,"Kv,ser",{"$f":"G8*G7*G6*G5","v":137250},"N/mm  "]
[]
{"$rows_left_out":5}
{"sheet":"CLT panel","index":8,"n_rows":48,"n_cols":19,"rows_kept":48,"hidden":true}
[]
[null,"CLT"]
[null,null,"Prod","h","Layers","Code","11","9","7","5","3","0","3'","5'","7'","9'","11'"]
[null,null,"HASSLACHER",{"$f":"SUM(CLT[[#This Row],[9]:[9'']])","v":60},{"$f":"COUNT(CLT[[#This Row],[9]:[9'']])","v":3},{"$f":"_xlfn.CONCAT(D4, \"mm-\",CLT[[#This Row],[Layers]],\"s\", \"-\",H4,\" \",I4,\" \",J4,\" \",K4,\" \",L4,\" \",M4,\" \",N4,\" \",O4,\" \",P4)","v":"60mm-3s-   20 20 20   "},{"$nulls":4},20,20,{"$f":"IF(ISBLANK(CLT[[#This Row],[3]]),\"\",CLT[[#This Row],[3]])","v":20},{"$f":"IF(ISBLANK(CLT[[#This Row],[5]]),\"\",CLT[[#This Row],[5]])","v":""},{"$f":"IF(ISBLANK(CLT[[#This Row],[7]]),\"\",CLT[[#This Row],[7]])","v":""},{"$f":"IF(ISBLANK(CLT[[#This Row],[9]]),\"\",CLT[[#This Row],[9]])","v":""}]
[null,null,"HASSLACHER",{"$f":"SUM(CLT[[#This Row],[9]:[9'']])","v":80},{"$f":"COUNT(CLT[[#This Row],[9]:[9'']])","v":3},{"$f":"_xlfn.CONCAT(D5, \"mm-\",CLT[[#This Row],[Layers]],\"s\", \"-\",H5,\" \",I5,\" \",J5,\" \",K5,\" \",L5,\" \",M5,\" \",N5,\" \",O5,\" \",P5)","v":"80mm-3s-   20 40 20   "},{"$nulls":4},20,40,{"$f":"CLT[[#This Row],[3]]","v":20},{"$f":"IF(ISBLANK(CLT[[#This Row],[5]]),\"\",CLT[[#This Row],[5]])","v":""},{"$f":"IF(ISBLANK(CLT[[#This Row],[7]]),\"\",CLT[[#This Row],[7]])","v":""},{"$f":"IF(ISBLANK(CLT[[#This Row],[9]]),\"\",CLT[[#This Row],[9]])","v":""}]
[null,null,"STORA",{"$f":"SUM(CLT[[#This Row],[9]:[9'']])","v":80},{"$f":"COUNT(CLT[[#This Row],[9]:[9'']])","v":3},{"$f":"_xlfn.CONCAT(D6, \"mm-\",CLT[[#This Row],[Layers]],\"s\", \"-\",H6,\" \",I6,\" \",J6,\" \",K6,\" \",L6,\" \",M6,\" \",N6,\" \",O6,\" \",P6)","v":"80mm-3s-   30 20 30   "},{"$nulls":4},30,20,{"$f":"CLT[[#This Row],[3]]","v":30},{"$f":"IF(ISBLANK(CLT[[#This Row],[5]]),\"\",CLT[[#This Row],[5]])","v":""},{"$f":"IF(ISBLANK(CLT[[#This Row],[7]]),\"\",CLT[[#This Row],[7]])","v":""},{"$f":"IF(ISBLANK(CLT[[#This Row],[9]]),\"\",CLT[[#This Row],[9]])","v":""}]
[null,null,"HASSLACHER",{"$f":"SUM(CLT[[#This Row],[9]:[9'']])","v":90},{"$f":"COUNT(CLT[[#This Row],[9]:[9'']])","v":3},{"$f":"_xlfn.CONCAT(D7, \"mm-\",CLT[[#This Row],[Layers]],\"s\", \"-\",H7,\" \",I7,\" \",J7,\" \",K7,\" \",L7,\" \",M7,\" \",N7,\" \",O7,\" \",P7)","v":"90mm-3s-   30 30 30   "},{"$nulls":4},30,30,{"$f":"CLT[[#This Row],[3]]","v":30},{"$f":"IF(ISBLANK(CLT[[#This Row],[5]]),\"\",CLT[[#This Row],[5]])","v":""},{"$f":"IF(ISBLANK(CLT[[#This Row],[7]]),\"\",CLT[[#This Row],[7]])","v":""},{"$f":"IF(ISBLANK(CLT[[#This Row],[9]]),\"\",CLT[[#This Row],[9]])","v":""}]
[null,null,"HASSLACHER",{"$f":"SUM(CLT[[#This Row],[9]:[9'']])","v":100},{"$f":"COUNT(CLT[[#This Row],[9]:[9'']])","v":3},{"$f":"_xlfn.CONCAT(D8, \"mm-\",CLT[[#This Row],[Layers]],\"s\", \"-\",H8,\" \",I8,\" \",J8,\" \",K8,\" \",L8,\" \",M8,\" \",N8,\" \",O8,\" \",P8)","v":"100mm-3s-   30 40 30   "},{"$nulls":4},30,40,{"$f":"CLT[[#This Row],[3]]","v":30},{"$f":"IF(ISBLANK(CLT[[#This Row],[5]]),\"\",CLT[[#This Row],[5]])","v":""},{"$f":"IF(ISBLANK(CLT[[#This Row],[7]]),\"\",CLT[[#This Row],[7]])","v":""},{"$f":"IF(ISBLANK(CLT[[#This Row],[9]]),\"\",CLT[[#This Row],[9]])","v":""},null,null,"80308030803080"]
[null,null,"HASSLACHER",{"$f":"SUM(CLT[[#This Row],[9]:[9'']])","v":120},{"$f":"COUNT(CLT[[#This Row],[9]:[9'']])","v":3},{"$f":"_xlfn.CONCAT(D9, \"mm-\",CLT[[#This Row],[Layers]],\"s\", \"-\",H9,\" \",I9,\" \",J9,\" \",K9,\" \",L9,\" \",M9,\" \",N9,\" \",O9,\" \",P9)","v":"120mm-3s-   40 40 40   "},{"$nulls":4},40,40,{"$f":"CLT[[#This Row],[3]]","v":40},{"$f":"IF(ISBLANK(CLT[[#This Row],[5]]),\"\",CLT[[#This Row],[5]])","v":""},{"$f":"IF(ISBLANK(CLT[[#This Row],[7]]),\"\",CLT[[#This Row],[7]])","v":""},{"$f":"IF(ISBLANK(CLT[[#This Row],[9]]),\"\",CLT[[#This Row],[9]])","v":""},null,null,"80308030803080"]
[null,null,"HASSLACHER",{"$f":"SUM(CLT[[#This Row],[9]:[9'']])","v":100},{"$f":"COUNT(CLT[[#This Row],[9]:[9'']])","v":5},{"$f":"_xlfn.CONCAT(D10, \"mm-\",CLT[[#This Row],[Layers]],\"s\", \"-\",H10,\" \",I10,\" \",J10,\" \",K10,\" \",L10,\" \",M10,\" \",N10,\" \",O10,\" \",P10)","v":"100mm-5s-  20 20 20 20 20  "},{"$nulls":3},20,20,20,{"$f":"CLT[[#This Row],[3]]","v":20},{"$f":"IF(ISBLANK(CLT[[#This Row],[5]]),\"\",CLT[[#This Row],[5]])","v":20},{"$f":"IF(ISBLANK(CLT[[#This Row],[7]]),\"\",CLT[[#This Row],[7]])","v":""},{"$f":"IF(ISBLANK(CLT[[#This Row],[9]]),\"\",CLT[[#This Row],[9]])","v":""}]
{"$rows_left_out":39}
{"sheet":"Dati","index":9,"n_rows":117,"n_cols":19,"rows_kept":117,"hidden":true,"merged":[[104,2,104,3],[105,3,105,4]]}
[]
["Tipo legno secondo EN338:2016, UNIEN14080:2013"]
["Classe","fm,k","ft,0,k","ft,90,k","fc,0,k","fc,90,k","fv,k","fr,k","E0,mean","E0,05","E90,mean","E90,05","Gmean","G05","Gr,mean","Gr,05","ρk","ρmean","γM"]
["GL20h - UNI EN14080:2013",20,16,0.5,20,2.5,3.5,1.2,8400,7000,300,250,650,540,65,54,340,370,{"$f":"IF(LEFT(TimberType[[#This Row],[Classe]])=\"GL\",IF(Input!$I$5=RefText_DB!$B$4,1.25,1.45),IF(Input!$I$5=RefText_DB!$B$4,1.3,1.5))","v":1.3}]
["GL22h - UNI EN14080:2013",22,17.6,0.5,22,2.5,3.5,1.2,10500,8800,300,250,650,540,65,54,370,410,{"$f":"IF(LEFT(TimberType[[#This Row],[Classe]])=\"GL\",IF(Input!$I$5=RefText_DB!$B$4,1.25,1.45),IF(Input!$I$5=RefText_DB!$B$4,1.3,1.5))","v":1.3}]
["GL24h - UNI EN14080:2013",24,19.2,0.5,24,2.5,3.5,1.2,11500,9600,300,250,650,540,65,54,385,420,{"$f":"IF(LEFT(TimberType[[#This Row],[Classe]])=\"GL\",IF(Input!$I$5=RefText_DB!$B$4,1.25,1.45),IF(Input!$I$5=RefText_DB!$B$4,1.3,1.5))","v":1.3}]
["GL26h - UNI EN14080:2013",26,20.8,0.5,26,2.5,3.5,1.2,12100,10100,300,250,650,540,65,54,405,445,{"$f":"IF(LEFT(TimberType[[#This Row],[Classe]])=\"GL\",IF(Input!$I$5=RefText_DB!$B$4,1.25,1.45),IF(Input!$I$5=RefText_DB!$B$4,1.3,1.5))","v":1.3}]
["GL28h - UNI EN14080:2013",28,22.3,0.5,28,2.5,3.5,1.2,12600,10500,300,250,650,540,65,54,425,460,{"$f":"IF(LEFT(TimberType[[#This Row],[Classe]])=\"GL\",IF(Input!$I$5=RefText_DB!$B$4,1.25,1.45),IF(Input!$I$5=RefText_DB!$B$4,1.3,1.5))","v":1.3}]
["GL30h - UNI EN14080:2013",30,24,0.5,30,2.5,3.5,1.2,13600,11300,300,250,650,540,65,54,430,480,{"$f":"IF(LEFT(TimberType[[#This Row],[Classe]])=\"GL\",IF(Input!$I$5=RefText_DB!$B$4,1.25,1.45),IF(Input!$I$5=RefText_DB!$B$4,1.3,1.5))","v":1.3}]
["GL32h - UNI EN14080:2013",32,25.6,0.5,32,2.5,3.5,1.2,14200,11800,300,250,650,540,65,54,440,490,{"$f":"IF(LEFT(TimberType[[#This Row],[Classe]])=\"GL\",IF(Input!$I$5=RefText_DB!$B$4,1.25,1.45),IF(Input!$I$5=RefText_DB!$B$4,1.3,1.5))","v":1.3}]
{"$rows_left_out":107}